Target
Steroidogenic factor 1
Ligand
BDBM39498
Substrate
Meas. Tech.
Dose-response cell-based assay for activators of the nuclear receptor Steroidogenic Factor 1 (SF-1)
EC50
4099±n/a nM
Citation
 PubChem, PC Dose-response cell-based assay for activators of the nuclear receptor Steroidogenic Factor 1 (SF-1) PubChem Bioassay (2007)[AID] 
Target
Name:
Steroidogenic factor 1
Synonyms:
AD4BP FTZF1 NR5A1 SF-1 STF-1 Steroid hormone receptor Ad4BP
Type:
Nuclear Hormone Receptor
Mol. Mass.:
51643.43
Organism:
Homo sapiens (Human)
Description:
Residue:
461
  
Inhibitor
Name:
BDBM39498
Synonyms:
5-bromanyl-N-[3-(5-phenyl-1,3,4-oxadiazol-2-yl)phenyl]furan-2-carboxamide 5-bromo-N-[3-(5-phenyl-1,3,4-oxadiazol-2-yl)phenyl]-2-furancarboxamide MLS000088943 cid_2192936
Type:
Small organic molecule
Emp. Form.:
C19H12BrN3O3
Mol. Mass.:
410.221
SMILES:
Brc1ccc(o1)C(=O)Nc1cccc(c1)-c1nnc(o1)-c1ccccc1
: