Target
Steroidogenic factor 1
Ligand
BDBM39510
Substrate
Meas. Tech.
Dose-response cell-based assay for activators of the nuclear receptor Steroidogenic Factor 1 (SF-1)
EC50
3764±n/a nM
Citation
 PubChem, PC Dose-response cell-based assay for activators of the nuclear receptor Steroidogenic Factor 1 (SF-1) PubChem Bioassay (2007)[AID] 
Target
Name:
Steroidogenic factor 1
Synonyms:
AD4BP FTZF1 NR5A1 SF-1 STF-1 Steroid hormone receptor Ad4BP
Type:
Nuclear Hormone Receptor
Mol. Mass.:
51643.43
Organism:
Homo sapiens (Human)
Description:
Residue:
461
  
Inhibitor
Name:
BDBM39510
Synonyms:
2-[(4-hydroxyanilino)methylene]cyclohexane-1,3-quinone 2-[[(4-hydroxyphenyl)amino]methylidene]cyclohexane-1,3-dione SMR000104929 | cid_759972
Type:
Small organic molecule
Emp. Form.:
C13H13NO3
Mol. Mass.:
231.2472
SMILES:
[#8]-c1ccc(-[#7]\[#6]=[#6]-2\[#6](=O)-[#6]-[#6]-[#6]-[#6]-2=O)cc1
: