Target
Steroidogenic factor 1
Ligand
BDBM39526
Substrate
Meas. Tech.
Counterscreen for activators of the Retinoic Acid Receptor-related orphan receptor A (RORA): A cell-based dose-response assay for inhibition of the Steroidogenic Factor 1 (SF-1)
EC50
5530±n/a nM
Citation
 PubChem, PC Counterscreen for activators of the Retinoic Acid Receptor-related orphan receptor A (RORA): A cell-based dose-response assay for inhibition of the Steroidogenic Factor 1 (SF-1) PubChem Bioassay (2007)[AID] 
Target
Name:
Steroidogenic factor 1
Synonyms:
AD4BP FTZF1 NR5A1 SF-1 STF-1 Steroid hormone receptor Ad4BP
Type:
Nuclear Hormone Receptor
Mol. Mass.:
51643.43
Organism:
Homo sapiens (Human)
Description:
Residue:
461
  
Inhibitor
Name:
BDBM39526
Synonyms:
MLS000032888 N-(2,3-dihydro-1,4-benzodioxin-6-yl)-4-(2-methylpropylsulfamoyl)benzamide SMR000003918 | cid_654454
Type:
Small organic molecule
Emp. Form.:
C19H22N2O5S
Mol. Mass.:
390.453
SMILES:
CC(C)CNS(=O)(=O)c1ccc(cc1)C(=O)Nc1ccc2OCCOc2c1
: