Target
Steroidogenic factor 1
Ligand
BDBM39538
Substrate
Meas. Tech.
Counterscreen for activators of the Retinoic Acid Receptor-related orphan receptor A (RORA): A cell-based dose-response assay for inhibition of the Steroidogenic Factor 1 (SF-1)
EC50
5083±n/a nM
Citation
 PubChem, PC Counterscreen for activators of the Retinoic Acid Receptor-related orphan receptor A (RORA): A cell-based dose-response assay for inhibition of the Steroidogenic Factor 1 (SF-1) PubChem Bioassay (2007)[AID] 
Target
Name:
Steroidogenic factor 1
Synonyms:
AD4BP FTZF1 NR5A1 SF-1 STF-1 Steroid hormone receptor Ad4BP
Type:
Nuclear Hormone Receptor
Mol. Mass.:
51643.43
Organism:
Homo sapiens (Human)
Description:
Residue:
461
  
Inhibitor
Name:
BDBM39538
Synonyms:
MLS000080478 cid_663772
Type:
Small organic molecule
Emp. Form.:
C14H12N6
Mol. Mass.:
264.2853
SMILES:
CCc1nnc2c3cnn(-c4ccccc4)c3ncn12
: