Target
14-3-3 protein gamma
Ligand
BDBM30708
Substrate
Meas. Tech.
14-3-3 protein interaction modulators Dose Response Confirmation
IC50
>50000±n/a nM
Citation
 PubChem, PC 14-3-3 protein interaction modulators Dose Response Confirmation PubChem Bioassay (2007)[AID] 
Target
Name:
14-3-3 protein gamma
Synonyms:
1433G_HUMAN tyrosine 3-monooxygenase/tryptophan 5-monooxygenase activation protein, gamma polypeptide
Type:
Enzyme Catalytic Domain
Mol. Mass.:
28289.17
Organism:
Homo sapiens (Human)
Description:
gi_21464101
Residue:
247
  
Inhibitor
Name:
BDBM30708
Synonyms:
(6aR,9R)-4,7-dimethyl-N-[(1S)-1-methylolpropyl]-6,6a,8,9-tetrahydroindolo[4,3-fg]quinoline-9-carboxamide;maleate (6aR,9R)-4,7-dimethyl-N-[(2S)-1-oxidanylbutan-2-yl]-6,6a,8,9-tetrahydroindolo[4,3-fg]quinoline-9-carboxamide;(Z)-but-2-enedioic acid (6aR,9R)-N-[(2S)-1-hydroxybutan-2-yl]-4,7-dimethyl-6,6a,8,9-tetrahydroindolo[4,3-fg]quinoline-9-carboxamide;(Z)-but-2-enedioic acid MLS000069364 cid_5281073
Type:
Small organic molecule
Emp. Form.:
C21H27N3O2
Mol. Mass.:
353.458
SMILES:
CC[C@@H](CO)NC(=O)[C@H]1CN(C)[C@@H]2Cc3cn(C)c4cccc(C2=C1)c34
: