Target
14-3-3 protein gamma
Ligand
BDBM38843
Substrate
Meas. Tech.
14-3-3 protein interaction modulators Dose Response Confirmation
IC50
>50000±n/a nM
Citation
 PubChem, PC 14-3-3 protein interaction modulators Dose Response Confirmation PubChem Bioassay (2007)[AID] 
Target
Name:
14-3-3 protein gamma
Synonyms:
1433G_HUMAN tyrosine 3-monooxygenase/tryptophan 5-monooxygenase activation protein, gamma polypeptide
Type:
Enzyme Catalytic Domain
Mol. Mass.:
28289.17
Organism:
Homo sapiens (Human)
Description:
gi_21464101
Residue:
247
  
Inhibitor
Name:
BDBM38843
Synonyms:
(3-methylcinnolin-5-yl)amine 3-methylcinnolin-5-amine SMR000055122 | cid_5310645
Type:
Small organic molecule
Emp. Form.:
C9H9N3
Mol. Mass.:
159.1879
SMILES:
Cc1cc2c(N)cccc2nn1
: