Target
Estrogen receptor
Ligand
BDBM34295
Substrate
Meas. Tech.
Estrogen Receptor-alpha Coactivator Binding Inhibitors Dose Response Confirmation
IC50
3548.86±n/a nM
Citation
 PubChem, PC Estrogen Receptor-alpha Coactivator Binding Inhibitors Dose Response Confirmation PubChem Bioassay (2007)[AID] 
Target
Name:
Estrogen receptor
Synonyms:
ER ESR ESR1_HUMAN Estrogen receptor Estrogen receptor (ER-alpha) Estrogen receptor alpha (ER) Nuclear receptor subfamily 3 group A member 1
Type:
Protein
Mol. Mass.:
66230.44
Organism:
Homo sapiens (Human)
Description:
P03372
Residue:
595
  
Inhibitor
Name:
BDBM34295
Synonyms:
6-keto-8-(5-methyl-2-furyl)-3-(m-tolyl)-2,4,7,8-tetrahydropyrido[2,1-b][1,3,5]thiadiazine-9-carbonitrile 8-(5-methylfuran-2-yl)-3-(3-methylphenyl)-6-oxidanylidene-2,4,7,8-tetrahydropyrido[2,1-b][1,3,5]thiadiazine-9-carbonitrile MLS000080648 cid_666162
Type:
Small organic molecule
Emp. Form.:
C20H19N3O2S
Mol. Mass.:
365.449
SMILES:
Cc1ccc(o1)C1CC(=O)N2CN(CSC2=C1C#N)c1cccc(C)c1
: