Target
Estrogen receptor
Ligand
BDBM40069
Substrate
Meas. Tech.
Estrogen Receptor-alpha Coactivator Binding Inhibitors Dose Response Confirmation
IC50
6299.84±n/a nM
Citation
 PubChem, PC Estrogen Receptor-alpha Coactivator Binding Inhibitors Dose Response Confirmation PubChem Bioassay (2007)[AID] 
Target
Name:
Estrogen receptor
Synonyms:
ER ESR ESR1_HUMAN Estrogen receptor Estrogen receptor (ER-alpha) Estrogen receptor alpha (ER) Nuclear receptor subfamily 3 group A member 1
Type:
Protein
Mol. Mass.:
66230.44
Organism:
Homo sapiens (Human)
Description:
P03372
Residue:
595
  
Inhibitor
Name:
BDBM40069
Synonyms:
MLS000097190 N-(2-phenyl-5-benzotriazolyl)-1,3-benzodioxole-5-carboxamide N-(2-phenylbenzotriazol-5-yl)-piperonylamide cid_2208079
Type:
Small organic molecule
Emp. Form.:
C20H14N4O3
Mol. Mass.:
358.3502
SMILES:
O=C(Nc1ccc2nn(nc2c1)-c1ccccc1)c1ccc2OCOc2c1
: