Target
Estrogen receptor
Ligand
BDBM40126
Substrate
Meas. Tech.
Estrogen Receptor-alpha Coactivator Binding Inhibitors Dose Response Confirmation
IC50
8308.43±n/a nM
Citation
 PubChem, PC Estrogen Receptor-alpha Coactivator Binding Inhibitors Dose Response Confirmation PubChem Bioassay (2007)[AID] 
Target
Name:
Estrogen receptor
Synonyms:
ER ESR ESR1_HUMAN Estrogen receptor Estrogen receptor (ER-alpha) Estrogen receptor alpha (ER) Nuclear receptor subfamily 3 group A member 1
Type:
Protein
Mol. Mass.:
66230.44
Organism:
Homo sapiens (Human)
Description:
P03372
Residue:
595
  
Inhibitor
Name:
BDBM40126
Synonyms:
MLS000111777 N-(4-chloro-2,5-dimethoxy-phenyl)-2-[4-(tetrazol-1-yl)phenoxy]acetamide N-(4-chloro-2,5-dimethoxyphenyl)-2-[4-(tetrazol-1-yl)phenoxy]acetamide cid_1139897
Type:
Small organic molecule
Emp. Form.:
C17H16ClN5O4
Mol. Mass.:
389.793
SMILES:
COc1cc(NC(=O)COc2ccc(cc2)-n2cnnn2)c(OC)cc1Cl
: