Target
Estrogen receptor
Ligand
BDBM40176
Substrate
Meas. Tech.
Estrogen Receptor-alpha Coactivator Binding Inhibitors Dose Response Confirmation
IC50
6904.21±n/a nM
Citation
 PubChem, PC Estrogen Receptor-alpha Coactivator Binding Inhibitors Dose Response Confirmation PubChem Bioassay (2007)[AID] 
Target
Name:
Estrogen receptor
Synonyms:
ER ESR ESR1_HUMAN Estrogen receptor Estrogen receptor (ER-alpha) Estrogen receptor alpha (ER) Nuclear receptor subfamily 3 group A member 1
Type:
Protein
Mol. Mass.:
66230.44
Organism:
Homo sapiens (Human)
Description:
P03372
Residue:
595
  
Inhibitor
Name:
BDBM40176
Synonyms:
3-methoxy-9,10-dimethyl-5-benzofuro[6,5-c][2]benzopyranone 3-methoxy-9,10-dimethyl-[1]benzofuro[6,5-c]isochromen-5-one MLS000594066 cid_707815
Type:
Small organic molecule
Emp. Form.:
C18H14O4
Mol. Mass.:
294.3014
SMILES:
COc1ccc2c3cc4c(C)c(C)oc4cc3oc(=O)c2c1
: