Target
Estrogen receptor
Ligand
BDBM40197
Substrate
Meas. Tech.
Estrogen Receptor-alpha Coactivator Binding Inhibitors Dose Response Confirmation
IC50
5150.58±n/a nM
Citation
 PubChem, PC Estrogen Receptor-alpha Coactivator Binding Inhibitors Dose Response Confirmation PubChem Bioassay (2007)[AID] 
Target
Name:
Estrogen receptor
Synonyms:
ER ESR ESR1_HUMAN Estrogen receptor Estrogen receptor (ER-alpha) Estrogen receptor alpha (ER) Nuclear receptor subfamily 3 group A member 1
Type:
Protein
Mol. Mass.:
66230.44
Organism:
Homo sapiens (Human)
Description:
P03372
Residue:
595
  
Inhibitor
Name:
BDBM40197
Synonyms:
(2Z)-2-[(8-quinolinylamino)methylidene]-1-benzothiophen-3-one (2Z)-2-[(quinolin-8-ylamino)methylidene]-1-benzothiophen-3-one MLS000530291 cid_5407397
Type:
Small organic molecule
Emp. Form.:
C18H12N2OS
Mol. Mass.:
304.366
SMILES:
Oc1c(C=Nc2cccc3cccnc23)sc2ccccc12
: