Target
Estrogen receptor
Ligand
BDBM40230
Substrate
Meas. Tech.
Estrogen Receptor-alpha Coactivator Binding Inhibitors Dose Response Confirmation
IC50
7237.52±n/a nM
Citation
 PubChem, PC Estrogen Receptor-alpha Coactivator Binding Inhibitors Dose Response Confirmation PubChem Bioassay (2007)[AID] 
Target
Name:
Estrogen receptor
Synonyms:
ER ESR ESR1_HUMAN Estrogen receptor Estrogen receptor (ER-alpha) Estrogen receptor alpha (ER) Nuclear receptor subfamily 3 group A member 1
Type:
Protein
Mol. Mass.:
66230.44
Organism:
Homo sapiens (Human)
Description:
P03372
Residue:
595
  
Inhibitor
Name:
BDBM40230
Synonyms:
2-(3-Furan-2-ylmethyl-2,4-dioxo-3,4,6,7,8,9-hexahydro-2H,5H-10-thia-1,3-diaza-benzo[a]azulen-1-yl)-N -phenyl-acetamide 2-[3-(2-furfuryl)-2,4-diketo-6,7,8,9-tetrahydro-5H-cyclohepta[2,3]thieno[2,4-b]pyrimidin-1-yl]-N-phenyl-acetamide 2-[3-(furan-2-ylmethyl)-2,4-dioxo-6,7,8,9-tetrahydro-5H-cyclohepta[2,3]thieno[2,4-b]pyrimidin-1-yl]-N-phenylacetamide SMR000149446 | cid_1954975
Type:
Small organic molecule
Emp. Form.:
C24H23N3O4S
Mol. Mass.:
449.522
SMILES:
O=C(Cn1c2sc3CCCCCc3c2c(=O)n(Cc2ccco2)c1=O)Nc1ccccc1
: