Target
Coagulation factor XII
Ligand
BDBM40329
Substrate
Meas. Tech.
Factor XIIa Dose Response Confirmation
IC50
>50000±0 nM
Citation
 PubChem, PC Factor XIIa Dose Response Confirmation PubChem Bioassay (2008)[AID] 
Target
Name:
Coagulation factor XII
Synonyms:
Beta-factor XIIa part 1 Carboxylesterase 2 (intestine, liver) Coagulation factor XII (FXII) Coagulation factor XIIa light chain FA12_HUMAN Factor XIIa (fXIIa) Hageman factor
Type:
Enzyme
Mol. Mass.:
67810.07
Organism:
Homo sapiens (Human)
Description:
P00748
Residue:
615
  
Inhibitor
Name:
BDBM40329
Synonyms:
MLS000070655 N-(4-oxidanylidene-1,3-benzothiazin-2-yl)ethanamide N-[4-Oxo-3,4-dihydro-benzo[e][1,3]thiazin-(2E)-ylidene]-acetamide cid_646071
Type:
Small organic molecule
Emp. Form.:
C10H8N2O2S
Mol. Mass.:
220.248
SMILES:
CC(=O)Nc1nc(=O)c2ccccc2s1
: