Target
Coagulation factor XII
Ligand
BDBM40336
Substrate
Meas. Tech.
Factor XIIa Dose Response Confirmation
IC50
>50000±0 nM
Citation
 PubChem, PC Factor XIIa Dose Response Confirmation PubChem Bioassay (2008)[AID] 
Target
Name:
Coagulation factor XII
Synonyms:
Beta-factor XIIa part 1 Carboxylesterase 2 (intestine, liver) Coagulation factor XII (FXII) Coagulation factor XIIa light chain FA12_HUMAN Factor XIIa (fXIIa) Hageman factor
Type:
Enzyme
Mol. Mass.:
67810.07
Organism:
Homo sapiens (Human)
Description:
P00748
Residue:
615
  
Inhibitor
Name:
BDBM40336
Synonyms:
6-Amino-4-isopropyl-3-thiophen-2-yl-2,4-dihydro-pyrano[2,3-c]pyrazole-5-carbonitrile 6-amino-4-propan-2-yl-3-thiophen-2-yl-2,4-dihydropyrano[2,3-c]pyrazole-5-carbonitrile MLS000033498 cid_652353
Type:
Small organic molecule
Emp. Form.:
C14H14N4OS
Mol. Mass.:
286.352
SMILES:
CC(C)C1C(C#N)C(=N)Oc2[nH]nc(-c3cccs3)c12
: