Target
Coagulation factor XII
Ligand
BDBM40339
Substrate
Meas. Tech.
Factor XIIa Dose Response Confirmation
IC50
>50000±0 nM
Citation
 PubChem, PC Factor XIIa Dose Response Confirmation PubChem Bioassay (2008)[AID] 
Target
Name:
Coagulation factor XII
Synonyms:
Beta-factor XIIa part 1 Carboxylesterase 2 (intestine, liver) Coagulation factor XII (FXII) Coagulation factor XIIa light chain FA12_HUMAN Factor XIIa (fXIIa) Hageman factor
Type:
Enzyme
Mol. Mass.:
67810.07
Organism:
Homo sapiens (Human)
Description:
P00748
Residue:
615
  
Inhibitor
Name:
BDBM40339
Synonyms:
(3-Tetrazol-1-yl-phenoxy)-acetic acid methyl ester 2-[3-(tetrazol-1-yl)phenoxy]acetic acid methyl ester SMR000002017 methyl 2-[3-(1,2,3,4-tetrazol-1-yl)phenoxy]ethanoate | methyl 2-[3-(tetrazol-1-yl)phenoxy]acetate
Type:
Small organic molecule
Emp. Form.:
C10H10N4O3
Mol. Mass.:
234.2114
SMILES:
COC(=O)COc1cccc(c1)-n1cnnn1
: