Target
Coagulation factor XII
Ligand
BDBM40351
Substrate
Meas. Tech.
Factor XIIa Dose Response Confirmation
IC50
>50000±0 nM
Citation
 PubChem, PC Factor XIIa Dose Response Confirmation PubChem Bioassay (2008)[AID] 
Target
Name:
Coagulation factor XII
Synonyms:
Beta-factor XIIa part 1 Carboxylesterase 2 (intestine, liver) Coagulation factor XII (FXII) Coagulation factor XIIa light chain FA12_HUMAN Factor XIIa (fXIIa) Hageman factor
Type:
Enzyme
Mol. Mass.:
67810.07
Organism:
Homo sapiens (Human)
Description:
P00748
Residue:
615
  
Inhibitor
Name:
BDBM40351
Synonyms:
6-amino-1-benzyl-5-[2-(3,4-dihydro-2H-quinolin-1-yl)acetyl]-3-methyl-pyrimidine-2,4-quinone 6-amino-5-[2-(3,4-dihydro-2H-quinolin-1-yl)-1-oxoethyl]-3-methyl-1-(phenylmethyl)pyrimidine-2,4-dione MLS000056405 cid_2087892
Type:
Small organic molecule
Emp. Form.:
C23H24N4O3
Mol. Mass.:
404.4617
SMILES:
Cn1c(=O)c(C(=O)CN2CCCc3ccccc23)c(N)n(Cc2ccccc2)c1=O
: