Target
Coagulation factor XII
Ligand
BDBM33435
Substrate
Meas. Tech.
Factor XIIa Dose Response Confirmation
IC50
7645.293333±1670.76832 nM
Citation
 PubChem, PC Factor XIIa Dose Response Confirmation PubChem Bioassay (2008)[AID] 
Target
Name:
Coagulation factor XII
Synonyms:
Beta-factor XIIa part 1 Carboxylesterase 2 (intestine, liver) Coagulation factor XII (FXII) Coagulation factor XIIa light chain FA12_HUMAN Factor XIIa (fXIIa) Hageman factor
Type:
Enzyme
Mol. Mass.:
67810.07
Organism:
Homo sapiens (Human)
Description:
P00748
Residue:
615
  
Inhibitor
Name:
BDBM33435
Synonyms:
3-(4-chlorophenyl)-1-(2-methoxybenzoyl)-1H-1,2,4-triazol-5-amine SMR000074510 [5-azanyl-3-(4-chlorophenyl)-1,2,4-triazol-1-yl]-(2-methoxyphenyl)methanone | cid_975143
Type:
Small organic molecule
Emp. Form.:
C16H13ClN4O2
Mol. Mass.:
328.753
SMILES:
COc1ccccc1C(=O)n1nc(nc1N)-c1ccc(Cl)cc1
: