Target
Coagulation factor XII
Ligand
BDBM40380
Substrate
Meas. Tech.
Factor XIIa Dose Response Confirmation
IC50
>50000±0 nM
Citation
 PubChem, PC Factor XIIa Dose Response Confirmation PubChem Bioassay (2008)[AID] 
Target
Name:
Coagulation factor XII
Synonyms:
Beta-factor XIIa part 1 Carboxylesterase 2 (intestine, liver) Coagulation factor XII (FXII) Coagulation factor XIIa light chain FA12_HUMAN Factor XIIa (fXIIa) Hageman factor
Type:
Enzyme
Mol. Mass.:
67810.07
Organism:
Homo sapiens (Human)
Description:
P00748
Residue:
615
  
Inhibitor
Name:
BDBM40380
Synonyms:
1-(2-fluorophenyl)-4-(propylsulfonyl)piperazine 1-(2-fluorophenyl)-4-propylsulfonylpiperazine SMR000074652 | cid_2947309
Type:
Small organic molecule
Emp. Form.:
C13H19FN2O2S
Mol. Mass.:
286.366
SMILES:
CCCS(=O)(=O)N1CCN(CC1)c1ccccc1F
: