Target
Coagulation factor XII
Ligand
BDBM40394
Substrate
Meas. Tech.
Factor XIIa Dose Response Confirmation
IC50
>50000±0 nM
Citation
 PubChem, PC Factor XIIa Dose Response Confirmation PubChem Bioassay (2008)[AID] 
Target
Name:
Coagulation factor XII
Synonyms:
Beta-factor XIIa part 1 Carboxylesterase 2 (intestine, liver) Coagulation factor XII (FXII) Coagulation factor XIIa light chain FA12_HUMAN Factor XIIa (fXIIa) Hageman factor
Type:
Enzyme
Mol. Mass.:
67810.07
Organism:
Homo sapiens (Human)
Description:
P00748
Residue:
615
  
Inhibitor
Name:
BDBM40394
Synonyms:
2-[[(5Z)-5-(3-indolylidene)-4-(2-methoxyethyl)-1H-1,2,4-triazol-3-yl]thio]acetamide 2-[[(5Z)-5-indol-3-ylidene-4-(2-methoxyethyl)-1H-1,2,4-triazol-3-yl]sulfanyl]ethanamide MLS000102175 cid_5310458
Type:
Small organic molecule
Emp. Form.:
C15H17N5O2S
Mol. Mass.:
331.393
SMILES:
COCCn1c(SCC(N)=O)nnc1-c1c[nH]c2ccccc12
: