Target
Coagulation factor XII
Ligand
BDBM40395
Substrate
Meas. Tech.
Factor XIIa Dose Response Confirmation
IC50
>50000±0 nM
Citation
 PubChem, PC Factor XIIa Dose Response Confirmation PubChem Bioassay (2008)[AID] 
Target
Name:
Coagulation factor XII
Synonyms:
Beta-factor XIIa part 1 Carboxylesterase 2 (intestine, liver) Coagulation factor XII (FXII) Coagulation factor XIIa light chain FA12_HUMAN Factor XIIa (fXIIa) Hageman factor
Type:
Enzyme
Mol. Mass.:
67810.07
Organism:
Homo sapiens (Human)
Description:
P00748
Residue:
615
  
Inhibitor
Name:
BDBM40395
Synonyms:
MLS000108814 N-[2-furyl-(8-hydroxy-7-quinolyl)methyl]-2-methyl-propionamide N-[furan-2-yl-(8-oxidanylquinolin-7-yl)methyl]-2-methyl-propanamide cid_2876959
Type:
Small organic molecule
Emp. Form.:
C18H18N2O3
Mol. Mass.:
310.3471
SMILES:
CC(C)C(=O)NC(c1ccco1)c1ccc2cccnc2c1O
: