Target
N-formyl peptide receptor 2
Ligand
BDBM40404
Substrate
Meas. Tech.
Formylpeptide Receptor (FPR) Ligand Structure Activity Relationship (SAR) Analysis : Dose Response Assay Counterscreen Against Formyl Peptide Receptor-Like-1 (FPRL1)
Ki
>40300±n/a nM
Citation
 PubChem, PC Formylpeptide Receptor (FPR) Ligand Structure Activity Relationship (SAR) Analysis : Dose Response Assay Counterscreen Against Formyl Peptide Receptor-Like-1 (FPRL1)  PubChem Bioassay (2007)[AID] 
Target
Name:
N-formyl peptide receptor 2
Synonyms:
ALXR, FPRL1, FPR2 FPR2 FPRH1 Formyl Peptide Receptor-Like 1 LXA4 receptor Lipoxin A4 receptor RFP | hFPRL
Type:
G Protein-Coupled Receptor (GPCR)
Mol. Mass.:
38968.35
Organism:
Homo sapiens (Human)
Description:
P25090
Residue:
351
  
Inhibitor
Name:
BDBM40404
Synonyms:
UNM000003536701 [6-ethyl-2-methyl-3-(1-methylbenzimidazol-2-yl)-4-oxochromen-7-yl] acetate acetic acid [6-ethyl-4-keto-2-methyl-3-(1-methylbenzimidazol-2-yl)chromen-7-yl] ester | cid_3092570
Type:
Small organic molecule
Emp. Form.:
C22H20N2O4
Mol. Mass.:
376.4052
SMILES:
CCc1cc2c(cc1OC(C)=O)oc(C)c(-c1nc3ccccc3n1C)c2=O
: