Target
N-formyl peptide receptor 2
Ligand
BDBM40415
Substrate
Meas. Tech.
Formylpeptide Receptor (FPR) Ligand Structure Activity Relationship (SAR) Analysis : Dose Response Assay Counterscreen Against Formyl Peptide Receptor-Like-1 (FPRL1)
Ki
>40300±n/a nM
Citation
 PubChem, PC Formylpeptide Receptor (FPR) Ligand Structure Activity Relationship (SAR) Analysis : Dose Response Assay Counterscreen Against Formyl Peptide Receptor-Like-1 (FPRL1)  PubChem Bioassay (2007)[AID] 
Target
Name:
N-formyl peptide receptor 2
Synonyms:
ALXR, FPRL1, FPR2 FPR2 FPRH1 Formyl Peptide Receptor-Like 1 LXA4 receptor Lipoxin A4 receptor RFP | hFPRL
Type:
G Protein-Coupled Receptor (GPCR)
Mol. Mass.:
38968.35
Organism:
Homo sapiens (Human)
Description:
P25090
Residue:
351
  
Inhibitor
Name:
BDBM40415
Synonyms:
2-furancarboxylic acid [3-(2-chlorophenyl)-4-oxo-2-(trifluoromethyl)-1-benzopyran-7-yl] ester [3-(2-chlorophenyl)-4-oxidanylidene-2-(trifluoromethyl)chromen-7-yl] furan-2-carboxylate cid_1036526 | furan-2-carboxylic acid [3-(2-chlorophenyl)-4-keto-2-(trifluoromethyl)chromen-7-yl] ester
Type:
Small organic molecule
Emp. Form.:
C21H10ClF3O5
Mol. Mass.:
434.749
SMILES:
FC(F)(F)c1oc2cc(OC(=O)c3ccco3)ccc2c(=O)c1-c1ccccc1Cl
: