Target
N-formyl peptide receptor 2
Ligand
BDBM40437
Substrate
Meas. Tech.
Formylpeptide Receptor (FPR) Ligand Structure Activity Relationship (SAR) Analysis : Dose Response Assay Counterscreen Against Formyl Peptide Receptor-Like-1 (FPRL1)
Ki
>40300±n/a nM
Citation
 PubChem, PC Formylpeptide Receptor (FPR) Ligand Structure Activity Relationship (SAR) Analysis : Dose Response Assay Counterscreen Against Formyl Peptide Receptor-Like-1 (FPRL1)  PubChem Bioassay (2007)[AID] 
Target
Name:
N-formyl peptide receptor 2
Synonyms:
ALXR, FPRL1, FPR2 FPR2 FPRH1 Formyl Peptide Receptor-Like 1 LXA4 receptor Lipoxin A4 receptor RFP | hFPRL
Type:
G Protein-Coupled Receptor (GPCR)
Mol. Mass.:
38968.35
Organism:
Homo sapiens (Human)
Description:
P25090
Residue:
351
  
Inhibitor
Name:
BDBM40437
Synonyms:
4-[(4E)-2,3-bis(oxidanylidene)-4-[oxidanyl(phenyl)methylidene]-5-[(E)-2-phenylethenyl]pyrrolidin-1-yl]butanoic acid 4-[(4E)-4-[hydroxy(phenyl)methylidene]-2,3-dioxo-5-[(E)-2-phenylethenyl]-1-pyrrolidinyl]butanoic acid UNM000003598701 | cid_5291834
Type:
Small organic molecule
Emp. Form.:
C23H21NO5
Mol. Mass.:
391.4165
SMILES:
OC(=O)CCCN1C(\C=C\c2ccccc2)C(C(=O)c2ccccc2)C(=O)C1=O
: