Target
N-formyl peptide receptor 2
Ligand
BDBM40411
Substrate
Meas. Tech.
Formylpeptide Receptor (FPR) Ligand Structure Activity Relationship (SAR) Analysis : Dose Response Assay Counterscreen Against Formyl Peptide Receptor-Like-1 (FPRL1)
IC50
>66700±n/a nM
Citation
 PubChem, PC Formylpeptide Receptor (FPR) Ligand Structure Activity Relationship (SAR) Analysis : Dose Response Assay Counterscreen Against Formyl Peptide Receptor-Like-1 (FPRL1)  PubChem Bioassay (2007)[AID] 
Target
Name:
N-formyl peptide receptor 2
Synonyms:
ALXR, FPRL1, FPR2 FPR2 FPRH1 Formyl Peptide Receptor-Like 1 LXA4 receptor Lipoxin A4 receptor RFP | hFPRL
Type:
G Protein-Coupled Receptor (GPCR)
Mol. Mass.:
38968.35
Organism:
Homo sapiens (Human)
Description:
P25090
Residue:
351
  
Inhibitor
Name:
BDBM40411
Synonyms:
(4E)-5-(2,5-dimethoxyphenyl)-4-[hydroxy(phenyl)methylene]-1-(3-pyridyl)pyrrolidine-2,3-quinone (4E)-5-(2,5-dimethoxyphenyl)-4-[hydroxy(phenyl)methylidene]-1-pyridin-3-ylpyrrolidine-2,3-dione UNM000003538701 | cid_5291451
Type:
Small organic molecule
Emp. Form.:
C24H20N2O5
Mol. Mass.:
416.426
SMILES:
COc1ccc(OC)c(c1)C1C(C(=O)c2ccccc2)C(=O)C(=O)N1c1cccnc1
: