Target
N-formyl peptide receptor 2
Ligand
BDBM40435
Substrate
Meas. Tech.
Formylpeptide Receptor (FPR) Ligand Structure Activity Relationship (SAR) Analysis : Dose Response Assay Counterscreen Against Formyl Peptide Receptor-Like-1 (FPRL1)
IC50
>66700±n/a nM
Citation
 PubChem, PC Formylpeptide Receptor (FPR) Ligand Structure Activity Relationship (SAR) Analysis : Dose Response Assay Counterscreen Against Formyl Peptide Receptor-Like-1 (FPRL1)  PubChem Bioassay (2007)[AID] 
Target
Name:
N-formyl peptide receptor 2
Synonyms:
ALXR, FPRL1, FPR2 FPR2 FPRH1 Formyl Peptide Receptor-Like 1 LXA4 receptor Lipoxin A4 receptor RFP | hFPRL
Type:
G Protein-Coupled Receptor (GPCR)
Mol. Mass.:
38968.35
Organism:
Homo sapiens (Human)
Description:
P25090
Residue:
351
  
Inhibitor
Name:
BDBM40435
Synonyms:
(4E)-5-(4-bromophenyl)-4-[(4-methylphenyl)-oxidanyl-methylidene]-1-(pyridin-3-ylmethyl)pyrrolidine-2,3-dione (4E)-5-(4-bromophenyl)-4-[hydroxy-(4-methylphenyl)methylidene]-1-(3-pyridinylmethyl)pyrrolidine-2,3-dione UNM000003597401 | cid_5732029
Type:
Small organic molecule
Emp. Form.:
C24H19BrN2O3
Mol. Mass.:
463.323
SMILES:
Cc1ccc(cc1)C(=O)C1C(N(Cc2cccnc2)C(=O)C1=O)c1ccc(Br)cc1
: