Target
fMet-Leu-Phe receptor
Ligand
BDBM40422
Substrate
Meas. Tech.
Formylpeptide Receptor (FPR) Ligand Structure Activity Relationship (SAR) Analysis : Dose Response Assay
Ki
>44300±n/a nM
Citation
 PubChem, PC Formylpeptide Receptor (FPR) Ligand Structure Activity Relationship (SAR) Analysis : Dose Response Assay PubChem Bioassay (2007)[AID] 
Target
Name:
fMet-Leu-Phe receptor
Synonyms:
FPR FPR1_HUMAN N-formyl peptide receptor 1 fMLP receptor formyl peptide receptor 1
Type:
Enzyme Catalytic Domain
Mol. Mass.:
38456.14
Organism:
Homo sapiens (Human)
Description:
gi_4503779
Residue:
350
  
Inhibitor
Name:
BDBM40422
Synonyms:
2-(3,4-dimethoxyphenyl)-3-(furan-2-carbonyl)-4-hydroxy-1-(3-morpholin-4-ylpropyl)-2H-pyrrol-5-one 2-(3,4-dimethoxyphenyl)-3-[2-furanyl(oxo)methyl]-4-hydroxy-1-[3-(4-morpholinyl)propyl]-2H-pyrrol-5-one UNM000003553701 | cid_2908584
Type:
Small organic molecule
Emp. Form.:
C24H28N2O7
Mol. Mass.:
456.4883
SMILES:
COc1ccc(cc1OC)C1C(C(=O)c2ccco2)C(=O)C(=O)N1CCCN1CCOCC1
: