Target
fMet-Leu-Phe receptor
Ligand
BDBM40449
Substrate
Meas. Tech.
Formylpeptide Receptor (FPR) Ligand Structure Activity Relationship (SAR) Analysis : Dose Response Assay
Ki
>44300±n/a nM
Citation
 PubChem, PC Formylpeptide Receptor (FPR) Ligand Structure Activity Relationship (SAR) Analysis : Dose Response Assay PubChem Bioassay (2007)[AID] 
Target
Name:
fMet-Leu-Phe receptor
Synonyms:
FPR FPR1_HUMAN N-formyl peptide receptor 1 fMLP receptor formyl peptide receptor 1
Type:
Enzyme Catalytic Domain
Mol. Mass.:
38456.14
Organism:
Homo sapiens (Human)
Description:
gi_4503779
Residue:
350
  
Inhibitor
Name:
BDBM40449
Synonyms:
4-(3-methoxyphenyl)-2-phenyl-1H-pyrazolo[3,4-b]pyridin-3-one cid_16043769
Type:
Small organic molecule
Emp. Form.:
C19H15N3O2
Mol. Mass.:
317.3413
SMILES:
COc1cccc(c1)-c1ccnc2[nH]n(-c3ccccc3)c(=O)c12
: