Target
fMet-Leu-Phe receptor
Ligand
BDBM50183472
Substrate
Meas. Tech.
Formylpeptide Receptor (FPR) Ligand Structure Activity Relationship (SAR) Analysis : Dose Response Assay
IC50
9800±n/a nM
Citation
 PubChem, PC Formylpeptide Receptor (FPR) Ligand Structure Activity Relationship (SAR) Analysis : Dose Response Assay PubChem Bioassay (2007)[AID] 
Target
Name:
fMet-Leu-Phe receptor
Synonyms:
FPR FPR1_HUMAN N-formyl peptide receptor 1 fMLP receptor formyl peptide receptor 1
Type:
Enzyme Catalytic Domain
Mol. Mass.:
38456.14
Organism:
Homo sapiens (Human)
Description:
gi_4503779
Residue:
350
  
Inhibitor
Name:
BDBM50183472
Synonyms:
5-(2,4-dimethoxyphenyl)-4-(furan-2-carbonyl)-3-hydroxy-1-(2-morpholinoethyl)-1H-pyrrol-2(5H)-one cid_2909444
Type:
Small organic molecule
Emp. Form.:
C23H26N2O7
Mol. Mass.:
442.4617
SMILES:
COc1ccc(C2C(C(=O)c3ccco3)C(=O)C(=O)N2CCN2CCOCC2)c(OC)c1
: