Target
Sphingosine 1-phosphate receptor 3
Ligand
BDBM31024
Substrate
Meas. Tech.
S1P3 Dose Response Assay Counterscreen for 5-Hydroxytryptamine(Serotonin) Receptor Subtype 1E Agonists
EC50
>40000±n/a nM
Citation
 PubChem, PC S1P3 Dose Response Assay Counterscreen for 5-Hydroxytryptamine(Serotonin) Receptor Subtype 1E Agonists PubChem Bioassay (2007)[AID] 
Target
Name:
Sphingosine 1-phosphate receptor 3
Synonyms:
C9orf108 EDG3 S1P receptor 3 S1P3 S1PR3_HUMAN Sphingosine 1-phosphate receptor 3 (S1P3) | Sphingosine 1-phosphate receptor Edg-3
Type:
G Protein-Coupled Receptor (GPCR)
Mol. Mass.:
42278.13
Organism:
Homo sapiens (Human)
Description:
Q99500
Residue:
378
  
Inhibitor
Name:
BDBM31024
Synonyms:
2-[2-methyl-7-(trifluoromethyl)-1H-indol-3-yl]ethanamine;hydrochloride MLS000047972 cid_6602844
Type:
Small organic molecule
Emp. Form.:
C12H13F3N2
Mol. Mass.:
242.2402
SMILES:
Cc1[nH]c2c(cccc2c1CCN)C(F)(F)F
: