Target
Sphingosine 1-phosphate receptor 3
Ligand
BDBM30925
Substrate
Meas. Tech.
S1P3 Dose Response Assay Counterscreen for 5-Hydroxytryptamine(Serotonin) Receptor Subtype 1E Agonists
EC50
>40000±n/a nM
Citation
 PubChem, PC S1P3 Dose Response Assay Counterscreen for 5-Hydroxytryptamine(Serotonin) Receptor Subtype 1E Agonists PubChem Bioassay (2007)[AID] 
Target
Name:
Sphingosine 1-phosphate receptor 3
Synonyms:
C9orf108 EDG3 S1P receptor 3 S1P3 S1PR3_HUMAN Sphingosine 1-phosphate receptor 3 (S1P3) | Sphingosine 1-phosphate receptor Edg-3
Type:
G Protein-Coupled Receptor (GPCR)
Mol. Mass.:
42278.13
Organism:
Homo sapiens (Human)
Description:
Q99500
Residue:
378
  
Inhibitor
Name:
BDBM30925
Synonyms:
2-({[2-(1H-indol-3-yl)ethyl]amino}carbonyl)cyclohexanecarboxylic acid 2-[2-(1H-indol-3-yl)ethylcarbamoyl]cyclohexanecarboxylic acid MLS000051191 cid_2965107
Type:
Small organic molecule
Emp. Form.:
C18H22N2O3
Mol. Mass.:
314.3789
SMILES:
OC(=O)C1CCCCC1C(=O)NCCc1c[nH]c2ccccc12
: