Target
Sphingosine 1-phosphate receptor 3
Ligand
BDBM31034
Substrate
Meas. Tech.
S1P3 Dose Response Assay Counterscreen for 5-Hydroxytryptamine(Serotonin) Receptor Subtype 1E Agonists
EC50
>40000±n/a nM
Citation
 PubChem, PC S1P3 Dose Response Assay Counterscreen for 5-Hydroxytryptamine(Serotonin) Receptor Subtype 1E Agonists PubChem Bioassay (2007)[AID] 
Target
Name:
Sphingosine 1-phosphate receptor 3
Synonyms:
C9orf108 EDG3 S1P receptor 3 S1P3 S1PR3_HUMAN Sphingosine 1-phosphate receptor 3 (S1P3) | Sphingosine 1-phosphate receptor Edg-3
Type:
G Protein-Coupled Receptor (GPCR)
Mol. Mass.:
42278.13
Organism:
Homo sapiens (Human)
Description:
Q99500
Residue:
378
  
Inhibitor
Name:
BDBM31034
Synonyms:
3-(1-methyl-3,6-dihydro-2H-pyridin-4-yl)-1H-indole MLS000120058 cid_152215
Type:
Small organic molecule
Emp. Form.:
C14H16N2
Mol. Mass.:
212.2902
SMILES:
CN1CCC(=CC1)c1c[nH]c2ccccc12
: