Target
Sphingosine 1-phosphate receptor 3
Ligand
BDBM31037
Substrate
Meas. Tech.
S1P3 Dose Response Assay Counterscreen for 5-Hydroxytryptamine(Serotonin) Receptor Subtype 1E Agonists
EC50
>40000±n/a nM
Citation
 PubChem, PC S1P3 Dose Response Assay Counterscreen for 5-Hydroxytryptamine(Serotonin) Receptor Subtype 1E Agonists PubChem Bioassay (2007)[AID] 
Target
Name:
Sphingosine 1-phosphate receptor 3
Synonyms:
C9orf108 EDG3 S1P receptor 3 S1P3 S1PR3_HUMAN Sphingosine 1-phosphate receptor 3 (S1P3) | Sphingosine 1-phosphate receptor Edg-3
Type:
G Protein-Coupled Receptor (GPCR)
Mol. Mass.:
42278.13
Organism:
Homo sapiens (Human)
Description:
Q99500
Residue:
378
  
Inhibitor
Name:
BDBM31037
Synonyms:
1-(2,4-dimethoxybenzyl)-4-(2-fluorophenyl)piperazine MLS000105278 cid_2173523
Type:
Small organic molecule
Emp. Form.:
C19H23FN2O2
Mol. Mass.:
330.3965
SMILES:
COc1ccc(CN2CCN(CC2)c2ccccc2F)c(OC)c1
: