Target
Collagenase 3
Ligand
BDBM50247488
Substrate
Meas. Tech.
Dose-response biochemical assay for inhibitors of Matrix Metalloproteinase 13 (MMP13) activity
IC50
23280±n/a nM
Citation
 PubChem, PC Dose-response biochemical assay for inhibitors of Matrix Metalloproteinase 13 (MMP13) activity PubChem Bioassay (2007)[AID] 
Target
Name:
Collagenase 3
Synonyms:
MMP-13 MMP13_HUMAN Matrix metalloproteinase-13 (MMP-13) | Matrix metalloproteinase-13 (MMP13)
Type:
Enzyme
Mol. Mass.:
53808.06
Organism:
Homo sapiens (Human)
Description:
P45452
Residue:
471
  
Inhibitor
Name:
BDBM50247488
Synonyms:
6-(3-methylbenzyl)-3-(4-methylbenzyl)-3H-[1,2,3]triazolo[4,5-d]pyrimidin-7(6H)-one cid_3243814
Type:
Small organic molecule
Emp. Form.:
C20H19N5O
Mol. Mass.:
345.3978
SMILES:
Cc1ccc(Cn2nnc3c2ncn(Cc2cccc(C)c2)c3=O)cc1
: