Target
Estrogen receptor
Ligand
BDBM40480
Substrate
Meas. Tech.
Estrogen Receptor-alpha Coactivator Binding Potentiators Dose Response Confirmation
EC50
23489.52±n/a nM
Citation
 PubChem, PC Estrogen Receptor-alpha Coactivator Binding Potentiators Dose Response Confirmation PubChem Bioassay (2007)[AID] 
Target
Name:
Estrogen receptor
Synonyms:
ER ESR ESR1_HUMAN Estrogen receptor Estrogen receptor (ER-alpha) Estrogen receptor alpha (ER) Nuclear receptor subfamily 3 group A member 1
Type:
Protein
Mol. Mass.:
66230.44
Organism:
Homo sapiens (Human)
Description:
P03372
Residue:
595
  
Inhibitor
Name:
BDBM40480
Synonyms:
2-[3-[3-(3-imidazol-1-ylpropyl)-4-keto-quinazolin-2-yl]propyl]isoindoline-1,3-quinone 2-[3-[3-(3-imidazol-1-ylpropyl)-4-oxoquinazolin-2-yl]propyl]isoindole-1,3-dione 2-{3-[3-(3-Imidazol-1-yl-propyl)-4-oxo-3,4-dihydro-quinazolin-2-yl]-propyl}-isoindole-1,3-dione SMR000010745 | cid_644964
Type:
Small organic molecule
Emp. Form.:
C25H23N5O3
Mol. Mass.:
441.4818
SMILES:
O=C1N(CCCc2nc3ccccc3c(=O)n2CCCn2ccnc2)C(=O)c2ccccc12
: