Target
Estrogen receptor
Ligand
BDBM37524
Substrate
Meas. Tech.
Estrogen Receptor-alpha Coactivator Binding Potentiators Dose Response Confirmation
EC50
9999000±n/a nM
Citation
 PubChem, PC Estrogen Receptor-alpha Coactivator Binding Potentiators Dose Response Confirmation PubChem Bioassay (2007)[AID] 
Target
Name:
Estrogen receptor
Synonyms:
ER ESR ESR1_HUMAN Estrogen receptor Estrogen receptor (ER-alpha) Estrogen receptor alpha (ER) Nuclear receptor subfamily 3 group A member 1
Type:
Protein
Mol. Mass.:
66230.44
Organism:
Homo sapiens (Human)
Description:
P03372
Residue:
595
  
Inhibitor
Name:
BDBM37524
Synonyms:
1-(2,5-Dimethoxy-phenyl)-2-[5-(3,4-dimethoxy-phenyl)-[1,3,4]oxadiazol-2-ylsulfanyl]-ethanone 1-(2,5-dimethoxyphenyl)-2-[[5-(3,4-dimethoxyphenyl)-1,3,4-oxadiazol-2-yl]thio]ethanone SMR000002383 | cid_649088
Type:
Small organic molecule
Emp. Form.:
C20H20N2O6S
Mol. Mass.:
416.448
SMILES:
COc1ccc(OC)c(c1)C(=O)CSc1nnc(o1)-c1ccc(OC)c(OC)c1
: