Target
Estrogen receptor
Ligand
BDBM40494
Substrate
Meas. Tech.
Estrogen Receptor-alpha Coactivator Binding Potentiators Dose Response Confirmation
EC50
12671.02±n/a nM
Citation
 PubChem, PC Estrogen Receptor-alpha Coactivator Binding Potentiators Dose Response Confirmation PubChem Bioassay (2007)[AID] 
Target
Name:
Estrogen receptor
Synonyms:
ER ESR ESR1_HUMAN Estrogen receptor Estrogen receptor (ER-alpha) Estrogen receptor alpha (ER) Nuclear receptor subfamily 3 group A member 1
Type:
Protein
Mol. Mass.:
66230.44
Organism:
Homo sapiens (Human)
Description:
P03372
Residue:
595
  
Inhibitor
Name:
BDBM40494
Synonyms:
MLS000036541 cid_661492
Type:
Small organic molecule
Emp. Form.:
C24H23N5O3
Mol. Mass.:
429.4711
SMILES:
COCCCn1c2nc(C)n(-c3ccccc3OC)c(=O)c2c2nc3ccccc3nc12
: