Target
Estrogen receptor
Ligand
BDBM40540
Substrate
Meas. Tech.
Estrogen Receptor-alpha Coactivator Binding Potentiators Dose Response Confirmation
EC50
9999000±n/a nM
Citation
 PubChem, PC Estrogen Receptor-alpha Coactivator Binding Potentiators Dose Response Confirmation PubChem Bioassay (2007)[AID] 
Target
Name:
Estrogen receptor
Synonyms:
ER ESR ESR1_HUMAN Estrogen receptor Estrogen receptor (ER-alpha) Estrogen receptor alpha (ER) Nuclear receptor subfamily 3 group A member 1
Type:
Protein
Mol. Mass.:
66230.44
Organism:
Homo sapiens (Human)
Description:
P03372
Residue:
595
  
Inhibitor
Name:
BDBM40540
Synonyms:
2-hydroxy-2-phenyl-acetic acid [2-(2,3-dihydro-1,4-benzodioxin-6-yl)-2-keto-ethyl] ester MLS000108559 [2-(2,3-dihydro-1,4-benzodioxin-6-yl)-2-oxidanylidene-ethyl] 2-oxidanyl-2-phenyl-ethanoate cid_2868311
Type:
Small organic molecule
Emp. Form.:
C18H16O6
Mol. Mass.:
328.316
SMILES:
OC(C(=O)OCC(=O)c1ccc2OCCOc2c1)c1ccccc1
: