Target
Estrogen receptor
Ligand
BDBM40542
Substrate
Meas. Tech.
Estrogen Receptor-alpha Coactivator Binding Potentiators Dose Response Confirmation
EC50
22565.27±n/a nM
Citation
 PubChem, PC Estrogen Receptor-alpha Coactivator Binding Potentiators Dose Response Confirmation PubChem Bioassay (2007)[AID] 
Target
Name:
Estrogen receptor
Synonyms:
ER ESR ESR1_HUMAN Estrogen receptor Estrogen receptor (ER-alpha) Estrogen receptor alpha (ER) Nuclear receptor subfamily 3 group A member 1
Type:
Protein
Mol. Mass.:
66230.44
Organism:
Homo sapiens (Human)
Description:
P03372
Residue:
595
  
Inhibitor
Name:
BDBM40542
Synonyms:
1-(3-methylsulfanyl-6-thiophen-3-yl-6H-[1,2,4]triazino[5,6-d][3,1]benzoxazepin-7-yl)ethanone 1-[3-(methylthio)-6-(3-thiophenyl)-6H-[1,2,4]triazino[5,6-d][3,1]benzoxazepin-7-yl]ethanone SMR000105988 | cid_5310802
Type:
Small organic molecule
Emp. Form.:
C17H14N4O2S2
Mol. Mass.:
370.449
SMILES:
CSc1nnc-2c(OC(N(C(C)=O)c3ccccc-23)c2ccsc2)n1
: