Target
Estrogen receptor
Ligand
BDBM40557
Substrate
Meas. Tech.
Estrogen Receptor-alpha Coactivator Binding Potentiators Dose Response Confirmation
EC50
11977.26±n/a nM
Citation
 PubChem, PC Estrogen Receptor-alpha Coactivator Binding Potentiators Dose Response Confirmation PubChem Bioassay (2007)[AID] 
Target
Name:
Estrogen receptor
Synonyms:
ER ESR ESR1_HUMAN Estrogen receptor Estrogen receptor (ER-alpha) Estrogen receptor alpha (ER) Nuclear receptor subfamily 3 group A member 1
Type:
Protein
Mol. Mass.:
66230.44
Organism:
Homo sapiens (Human)
Description:
P03372
Residue:
595
  
Inhibitor
Name:
BDBM40557
Synonyms:
5-(3-methoxyphenyl)-N-(5-methyl-2-phenyl-3-pyrazolyl)-3-isoxazolecarboxamide 5-(3-methoxyphenyl)-N-(5-methyl-2-phenyl-pyrazol-3-yl)isoxazole-3-carboxamide MLS000520005 cid_9551037
Type:
Small organic molecule
Emp. Form.:
C21H18N4O3
Mol. Mass.:
374.3926
SMILES:
COc1cccc(c1)-c1cc(no1)C(=O)Nc1cc(C)nn1-c1ccccc1
: