Target
Nuclear receptor subfamily 4 group A member 1
Ligand
BDBM34170
Substrate
Meas. Tech.
High Throughput Fluorescence Polarization Screen for Bcl-B Phenotype Converters
IC50
8499.2±798 nM
Citation
 PubChem, PC High Throughput Fluorescence Polarization Screen for Bcl-B Phenotype Converters PubChem Bioassay (2008)[AID] 
Target
Name:
Nuclear receptor subfamily 4 group A member 1
Synonyms:
GFRP1 NAK1 NR4A1_HUMAN | nuclear receptor subfamily 4, group A, member 1
Type:
Enzyme Catalytic Domain
Mol. Mass.:
64467.13
Organism:
Homo sapiens (Human)
Description:
gi_27894344
Residue:
598
  
Inhibitor
Name:
BDBM34170
Synonyms:
2-[(2-ethyl-1-keto-7,8-dihydro-6H-cyclopenta[2,3]thieno[2,4-b]pyrimidin-3-yl)thio]acetic acid 2-[(2-ethyl-1-oxo-7,8-dihydro-6H-cyclopenta[2,3]thieno[2,4-b]pyrimidin-3-yl)sulfanyl]acetic acid MLS000069140 cid_658077
Type:
Small organic molecule
Emp. Form.:
C13H14N2O3S2
Mol. Mass.:
310.392
SMILES:
CCn1c(SCC(O)=O)nc2sc3CCCc3c2c1=O
: