Target
Nuclear receptor subfamily 4 group A member 1
Ligand
BDBM40587
Substrate
Meas. Tech.
High Throughput Fluorescence Polarization Screen for Bcl-B Phenotype Converters
IC50
>6250±0 nM
Citation
 PubChem, PC High Throughput Fluorescence Polarization Screen for Bcl-B Phenotype Converters PubChem Bioassay (2008)[AID] 
Target
Name:
Nuclear receptor subfamily 4 group A member 1
Synonyms:
GFRP1 NAK1 NR4A1_HUMAN | nuclear receptor subfamily 4, group A, member 1
Type:
Enzyme Catalytic Domain
Mol. Mass.:
64467.13
Organism:
Homo sapiens (Human)
Description:
gi_27894344
Residue:
598
  
Inhibitor
Name:
BDBM40587
Synonyms:
2-azanyl-5-ethanoyl-4-(furan-2-yl)-6-methyl-4H-pyran-3-carbonitrile 5-acetyl-2-amino-4-(2-furyl)-6-methyl-4H-pyran-3-carbonitrile MLS000080020 cid_540386
Type:
Small organic molecule
Emp. Form.:
C13H12N2O3
Mol. Mass.:
244.246
SMILES:
CC(=O)C1=C(C)OC(=N)C(C#N)C1c1ccco1
: