Target
Nuclear receptor subfamily 4 group A member 1
Ligand
BDBM40694
Substrate
Meas. Tech.
High Throughput Fluorescence Polarization Screen for Bcl-B Phenotype Converters
IC50
12045±871 nM
Citation
 PubChem, PC High Throughput Fluorescence Polarization Screen for Bcl-B Phenotype Converters PubChem Bioassay (2008)[AID] 
Target
Name:
Nuclear receptor subfamily 4 group A member 1
Synonyms:
GFRP1 NAK1 NR4A1_HUMAN | nuclear receptor subfamily 4, group A, member 1
Type:
Enzyme Catalytic Domain
Mol. Mass.:
64467.13
Organism:
Homo sapiens (Human)
Description:
gi_27894344
Residue:
598
  
Inhibitor
Name:
BDBM40694
Synonyms:
2-(2-furanyl)-4-quinolinecarboxylic acid [2-[4-[2-furanyl(oxo)methyl]-1-piperazinyl]-2-oxoethyl] ester MLS000565090 [2-[4-(furan-2-carbonyl)piperazin-1-yl]-2-oxoethyl] 2-(furan-2-yl)quinoline-4-carboxylate cid_2434862
Type:
Small organic molecule
Emp. Form.:
C25H21N3O6
Mol. Mass.:
459.4507
SMILES:
O=C(COC(=O)c1cc(nc2ccccc12)-c1ccco1)N1CCN(CC1)C(=O)c1ccco1
: