Target
Heat shock protein HSP 90-alpha
Ligand
BDBM32174
Substrate
Meas. Tech.
Cell-based secondary assay for identifying Hsp90 inhibitors that degrade Hsp90 client protein Her2
IC50
>60000±n/a nM
Citation
 PubChem, PC Cell-based secondary assay for identifying Hsp90 inhibitors that degrade Hsp90 client protein Her2 PubChem Bioassay (2007)[AID] 
Target
Name:
Heat shock protein HSP 90-alpha
Synonyms:
HS90A_HUMAN HSP86 HSP90AA1 HSPCA Heat shock 86 kDa Heat shock protein HSP 90-alpha (HSP90) LAP-2 Lipopolysaccharide-associated protein 2 heat shock protein 90kDa alpha (cytosolic), class A member 1 isoform 2
Type:
Molecular Chaperone
Mol. Mass.:
84623.45
Organism:
Homo sapiens (Human)
Description:
P07900
Residue:
732
  
Inhibitor
Name:
BDBM32174
Synonyms:
N-[4-amino-3-(2-hydroxyphenyl)phenyl]-3,4-dimethoxy-benzenesulfonamide N-[4-azanyl-3-(2-hydroxyphenyl)phenyl]-3,4-dimethoxy-benzenesulfonamide cid_16072268
Type:
Small organic molecule
Emp. Form.:
C20H20N2O5S
Mol. Mass.:
400.448
SMILES:
COc1ccc(cc1OC)S(=O)(=O)Nc1ccc(N)c(c1)-c1ccccc1O
: