Target
Heat shock protein HSP 90-alpha
Ligand
BDBM32195
Substrate
Meas. Tech.
Cell-based secondary assay for identifying Hsp90 inhibitors that degrade Hsp90 client protein Her2
IC50
>50000±n/a nM
Citation
 PubChem, PC Cell-based secondary assay for identifying Hsp90 inhibitors that degrade Hsp90 client protein Her2 PubChem Bioassay (2007)[AID] 
Target
Name:
Heat shock protein HSP 90-alpha
Synonyms:
HS90A_HUMAN HSP86 HSP90AA1 HSPCA Heat shock 86 kDa Heat shock protein HSP 90-alpha (HSP90) LAP-2 Lipopolysaccharide-associated protein 2 heat shock protein 90kDa alpha (cytosolic), class A member 1 isoform 2
Type:
Molecular Chaperone
Mol. Mass.:
84623.45
Organism:
Homo sapiens (Human)
Description:
P07900
Residue:
732
  
Inhibitor
Name:
BDBM32195
Synonyms:
4-chloranyl-N-[4-fluoranyl-3-(5-oxidanyl-1,3-benzodioxol-4-yl)phenyl]-3-nitro-benzenesulfonamide 4-chloro-N-[4-fluoro-3-(5-hydroxy-1,3-benzodioxol-4-yl)phenyl]-3-nitrobenzenesulfonamide cid_16072279
Type:
Small organic molecule
Emp. Form.:
C19H12ClFN2O7S
Mol. Mass.:
466.824
SMILES:
Oc1ccc2OCOc2c1-c1cc(NS(=O)(=O)c2ccc(Cl)c(c2)[N+]([O-])=O)ccc1F
: