Target
fMet-Leu-Phe receptor
Ligand
BDBM37701
Substrate
Meas. Tech.
Formylpeptide Receptor (FPRL1) Ligand Structure Activity Relationship (SAR) Analysis : FPR Dose Response Counterscreen Assay
Ki
>32700±n/a nM
Citation
 PubChem, PC Formylpeptide Receptor (FPRL1) Ligand Structure Activity Relationship (SAR) Analysis : FPR Dose Response Counterscreen Assay PubChem Bioassay (2007)[AID] 
Target
Name:
fMet-Leu-Phe receptor
Synonyms:
FPR FPR1_HUMAN N-formyl peptide receptor 1 fMLP receptor formyl peptide receptor 1
Type:
Enzyme Catalytic Domain
Mol. Mass.:
38456.14
Organism:
Homo sapiens (Human)
Description:
gi_4503779
Residue:
350
  
Inhibitor
Name:
BDBM37701
Synonyms:
4-(3,4-dimethoxyphenyl)-2-(4-phenyl-1-piperazinyl)-6-(trifluoromethyl)pyrimidine 4-(3,4-dimethoxyphenyl)-2-(4-phenylpiperazino)-6-(trifluoromethyl)pyrimidine SMR000022330 | cid_3237714
Type:
Small organic molecule
Emp. Form.:
C23H23F3N4O2
Mol. Mass.:
444.4495
SMILES:
COc1ccc(cc1OC)-c1cc(nc(n1)N1CCN(CC1)c1ccccc1)C(F)(F)F
: