Target
N-formyl peptide receptor 2
Ligand
BDBM40748
Substrate
Meas. Tech.
Formylpeptide Receptor (FPRL1) Ligand Structure Activity Relationship (SAR) Analysis : Dose Response Assay
IC50
>50500±n/a nM
Citation
 PubChem, PC Formylpeptide Receptor (FPRL1) Ligand Structure Activity Relationship (SAR) Analysis : Dose Response Assay PubChem Bioassay (2007)[AID] 
Target
Name:
N-formyl peptide receptor 2
Synonyms:
ALXR, FPRL1, FPR2 FPR2 FPRH1 Formyl Peptide Receptor-Like 1 LXA4 receptor Lipoxin A4 receptor RFP | hFPRL
Type:
G Protein-Coupled Receptor (GPCR)
Mol. Mass.:
38968.35
Organism:
Homo sapiens (Human)
Description:
P25090
Residue:
351
  
Inhibitor
Name:
BDBM40748
Synonyms:
4-[4-(3,4-dimethoxyphenyl)-6-(trifluoromethyl)-2-pyrimidinyl]-1-piperazinecarboxylic acid ethyl ester UNM000003655101 ethyl 4-[4-(3,4-dimethoxyphenyl)-6-(trifluoromethyl)pyrimidin-2-yl]piperazine-1-carboxylate
Type:
Small organic molecule
Emp. Form.:
C20H23F3N4O4
Mol. Mass.:
440.4162
SMILES:
CCOC(=O)N1CCN(CC1)c1nc(cc(n1)C(F)(F)F)-c1ccc(OC)c(OC)c1
: