Target
N-formyl peptide receptor 2
Ligand
BDBM40754
Substrate
Meas. Tech.
Formylpeptide Receptor (FPRL1) Ligand Structure Activity Relationship (SAR) Analysis : Dose Response Assay
IC50
9900±n/a nM
Citation
 PubChem, PC Formylpeptide Receptor (FPRL1) Ligand Structure Activity Relationship (SAR) Analysis : Dose Response Assay PubChem Bioassay (2007)[AID] 
Target
Name:
N-formyl peptide receptor 2
Synonyms:
ALXR, FPRL1, FPR2 FPR2 FPRH1 Formyl Peptide Receptor-Like 1 LXA4 receptor Lipoxin A4 receptor RFP | hFPRL
Type:
G Protein-Coupled Receptor (GPCR)
Mol. Mass.:
38968.35
Organism:
Homo sapiens (Human)
Description:
P25090
Residue:
351
  
Inhibitor
Name:
BDBM40754
Synonyms:
N-(5-imidazo[1,2-a]pyrimidin-2-yl-2-methoxy-phenyl)-2-(4-methoxyphenyl)acetamide N-(5-imidazo[1,2-a]pyrimidin-2-yl-2-methoxyphenyl)-2-(4-methoxyphenyl)acetamide UNM000003661901 | cid_7080289
Type:
Small organic molecule
Emp. Form.:
C22H20N4O3
Mol. Mass.:
388.4192
SMILES:
COc1ccc(CC(=O)Nc2cc(ccc2OC)-c2cn3cccnc3n2)cc1
: