Target
Sphingosine 1-phosphate receptor 3
Ligand
BDBM31052
Substrate
Meas. Tech.
S1P3 Dose Response Assay Counterscreen for 5-Hydroxytryptamine(Serotonin) Receptor Subtype 1E Antagonists
IC50
>12390±n/a nM
Citation
 PubChem, PC S1P3 Dose Response Assay Counterscreen for 5-Hydroxytryptamine(Serotonin) Receptor Subtype 1E Antagonists PubChem Bioassay (2007)[AID] 
Target
Name:
Sphingosine 1-phosphate receptor 3
Synonyms:
C9orf108 EDG3 S1P receptor 3 S1P3 S1PR3_HUMAN Sphingosine 1-phosphate receptor 3 (S1P3) | Sphingosine 1-phosphate receptor Edg-3
Type:
G Protein-Coupled Receptor (GPCR)
Mol. Mass.:
42278.13
Organism:
Homo sapiens (Human)
Description:
Q99500
Residue:
378
  
Inhibitor
Name:
BDBM31052
Synonyms:
1-[1,1-bis(trifluoromethyl)propyl]-3-[5-(trifluoromethyl)-1,3,4-thiadiazol-2-yl]urea 1-[5-(trifluoromethyl)-1,3,4-thiadiazol-2-yl]-3-[1,1,1-tris(fluoranyl)-2-(trifluoromethyl)butan-2-yl]urea SMR000040781 | cid_659822
Type:
Small organic molecule
Emp. Form.:
C9H7F9N4OS
Mol. Mass.:
390.229
SMILES:
CCC(NC(=O)Nc1nnc(s1)C(F)(F)F)(C(F)(F)F)C(F)(F)F
: