Target
Sphingosine 1-phosphate receptor 3
Ligand
BDBM31064
Substrate
Meas. Tech.
S1P3 Dose Response Assay Counterscreen for 5-Hydroxytryptamine(Serotonin) Receptor Subtype 1E Antagonists
IC50
4877±n/a nM
Citation
 PubChem, PC S1P3 Dose Response Assay Counterscreen for 5-Hydroxytryptamine(Serotonin) Receptor Subtype 1E Antagonists PubChem Bioassay (2007)[AID] 
Target
Name:
Sphingosine 1-phosphate receptor 3
Synonyms:
C9orf108 EDG3 S1P receptor 3 S1P3 S1PR3_HUMAN Sphingosine 1-phosphate receptor 3 (S1P3) | Sphingosine 1-phosphate receptor Edg-3
Type:
G Protein-Coupled Receptor (GPCR)
Mol. Mass.:
42278.13
Organism:
Homo sapiens (Human)
Description:
Q99500
Residue:
378
  
Inhibitor
Name:
BDBM31064
Synonyms:
4-(2-furanyl)-2-methylsulfonyl-6-(trifluoromethyl)pyrimidine 4-(2-furyl)-2-mesyl-6-(trifluoromethyl)pyrimidine MLS000044646 cid_3237865
Type:
Small organic molecule
Emp. Form.:
C10H7F3N2O3S
Mol. Mass.:
292.234
SMILES:
CS(=O)(=O)c1nc(cc(n1)C(F)(F)F)-c1ccco1
: