Target
Sphingosine 1-phosphate receptor 3
Ligand
BDBM31080
Substrate
Meas. Tech.
S1P3 Dose Response Assay Counterscreen for 5-Hydroxytryptamine(Serotonin) Receptor Subtype 1E Antagonists
IC50
5057±n/a nM
Citation
 PubChem, PC S1P3 Dose Response Assay Counterscreen for 5-Hydroxytryptamine(Serotonin) Receptor Subtype 1E Antagonists PubChem Bioassay (2007)[AID] 
Target
Name:
Sphingosine 1-phosphate receptor 3
Synonyms:
C9orf108 EDG3 S1P receptor 3 S1P3 S1PR3_HUMAN Sphingosine 1-phosphate receptor 3 (S1P3) | Sphingosine 1-phosphate receptor Edg-3
Type:
G Protein-Coupled Receptor (GPCR)
Mol. Mass.:
42278.13
Organism:
Homo sapiens (Human)
Description:
Q99500
Residue:
378
  
Inhibitor
Name:
BDBM31080
Synonyms:
1-(2,4-dimethylphenyl)-4-[4-(3-methoxyphenyl)-1-piperazinyl]pyrazolo[3,4-d]pyrimidine 1-(2,4-dimethylphenyl)-4-[4-(3-methoxyphenyl)piperazino]pyrazolo[3,4-d]pyrimidine SMR000017007 | cid_1881562
Type:
Small organic molecule
Emp. Form.:
C24H26N6O
Mol. Mass.:
414.5028
SMILES:
COc1cccc(c1)N1CCN(CC1)c1ncnc2n(ncc12)-c1ccc(C)cc1C
: